Son İletiler

Sayfa: [1] 2 3 ... 10
1
Operada genel bir sorun var gibi görünüyor.Yeni bir güncellemeyi bekleyecegiz,yada çözümü kendi forumundan takip edeceğiz.
https://forums.opera.com/topic/23903/i-don-t-see-videos-on-twitter
2
Kod: [Seç]
mami@bananapi:~/DPO_MT7601U_LinuxSTA_3.0.0.4_20130913$ sudo make install
[sudo] password for mami:
make -C /home/mami/DPO_MT7601U_LinuxSTA_3.0.0.4_20130913/os/linux -f Makefile.6 install
make[1]: Entering directory '/home/mami/DPO_MT7601U_LinuxSTA_3.0.0.4_20130913/os/linux'
mkdir: cannot create directory ‘/etc/Wireless’: File exists
rm -rf /etc/Wireless/RT2870STA
mkdir /etc/Wireless/RT2870STA
cp /home/mami/DPO_MT7601U_LinuxSTA_3.0.0.4_20130913/RT2870STA.dat /etc/Wireless/RT2870STA/.
install -d /lib/modules/3.4.113-sun7i/kernel/drivers/net/wireless/
install -m 644 -c mt7601Usta.ko /lib/modules/3.4.113-sun7i/kernel/drivers/net/wireless/
install: cannot stat 'mt7601Usta.ko': No such file or directory
Makefile.6:555: recipe for target 'install' failed
make[1]: *** [install] Error 1
make[1]: Leaving directory '/home/mami/DPO_MT7601U_LinuxSTA_3.0.0.4_20130913/os/linux'
Makefile:503: recipe for target 'install' failed
make: *** [install] Error 2
3
Bu da sorunumu çözmedi diğer tarayıcılarda bir sıkıntım yok ama operada çalışmıyor videolar. Özellikle opera da ısrar etmemin sebebi diğer tarayıcılarımda (chrome - firefox) fan sürekli çalışıyor, operada nispeten daha az.
Rastgele seçtiğim çalışmayan video linki http://dizipub.com/above-suspicion-1-sezon-2-bolum/2/
4
Kod: [Seç]
make install
yerine

Kod: [Seç]
sudo make install
yazarak devam edin (komutu sürücü kaynak dosyasının bulunduğu DPO_MT7601U_LinuxSTA_3.0.0.4_20130913 dizini içinde çalıştırmalısınız, dizinden çıktı iseniz cd komutu ile yeniden dizin içine girebilirsiniz.).
5
Aşağıda verdiğiniz tüm komutların çıktısı var. Açıkcası tüm bu işlemleri yaptıktan sonra beklediğimiz "iwconfig" komutundan sonra ra0 gelmesi mi ? Wi-Fi nin yi internetime bağlı olup olmadığını nasıl kontrol edeceğim.

Kod: [Seç]
sudo apt-get -y install linux-headers-sun7i build-essential
Reading package lists... Done
Building dependency tree
Reading state information... Done
build-essential is already the newest version (12.1ubuntu2).
linux-headers-sun7i is already the newest version (5.35).
0 upgraded, 0 newly installed, 0 to remove and 5 not upgraded.


Kod: [Seç]
wget -c --no-check-certificate http://cdn-cw.mediatek.com/Downloads/linux/DPO_MT7601U_LinuxSTA_3.0.0.4_20130913.tar.bz2
--2017-12-13 10:10:59--  http://cdn-cw.mediatek.com/Downloads/linux/DPO_MT7601U_LinuxSTA_3.0.0.4_20130913.tar.bz2
Resolving cdn-cw.mediatek.com (cdn-cw.mediatek.com)... 13.32.163.18, 13.32.163.113, 13.32.163.58, ...
Connecting to cdn-cw.mediatek.com (cdn-cw.mediatek.com)|13.32.163.18|:80... connected.
HTTP request sent, awaiting response... 200 OK
Length: 1178551 (1.1M) [application/octet-stream]
Saving to: ‘DPO_MT7601U_LinuxSTA_3.0.0.4_20130913.tar.bz2’

DPO_MT7601U_LinuxSTA_3. 100%[==============================>]   1.12M  4.28MB/s    in 0.3s

2017-12-13 10:10:59 (4.28 MB/s) - ‘DPO_MT7601U_LinuxSTA_3.0.0.4_20130913.tar.bz2’ saved [1178551/1178551]


Kod: [Seç]
mami@bananapi:~$ cd DPO_MT7601U_LinuxSTA_3.0.0.4_20130913
mami@bananapi:~/DPO_MT7601U_LinuxSTA_3.0.0.4_20130913$


make komutunun çıktısı için tıklayın. (Karakter limitini geçiyor.)

Kod: [Seç]
make install
make -C /home/mami/DPO_MT7601U_LinuxSTA_3.0.0.4_20130913/os/linux -f Makefile.6 install
make[1]: Entering directory '/home/mami/DPO_MT7601U_LinuxSTA_3.0.0.4_20130913/os/linux'
mkdir: cannot create directory ‘/etc/Wireless’: File exists
rm -rf /etc/Wireless/RT2870STA
rm: cannot remove '/etc/Wireless/RT2870STA/RT2870STA.dat': Permission denied
Makefile.6:555: recipe for target 'install' failed
make[1]: *** [install] Error 1
make[1]: Leaving directory '/home/mami/DPO_MT7601U_LinuxSTA_3.0.0.4_20130913/os/linux'
Makefile:503: recipe for target 'install' failed
make: *** [install] Error 2

Kod: [Seç]
mami@bananapi:~/DPO_MT7601U_LinuxSTA_3.0.0.4_20130913$ modprobe mt7601Usta
mami@bananapi:~/DPO_MT7601U_LinuxSTA_3.0.0.4_20130913$ lsmod
Module                  Size  Used by
bnep                   14360  2
disp_ump                 850  0
mali_drm                2611  1
drm                   214553  2 mali_drm
cpufreq_userspace       3540  0
mt7601Usta            806104  0
spidev                  6339  0
mali                  112222  0
ump                    61778  4 mali,disp_ump
a20_tp                  3294  0
8021q                  18659  0
garp                    6084  1 8021q
stp                     2028  1 garp
llc                     5421  2 stp,garp
sunxi_ir                4044  0
hidp                   17740  0
rfcomm                 58820  0
hci_uart               25074  0
bluetooth             265449  10 bnep,hidp,hci_uart,rfcomm

Kod: [Seç]
mami@bananapi:~/DPO_MT7601U_LinuxSTA_3.0.0.4_20130913$ iwconfig
lo        no wireless extensions.

eth0      no wireless extensions.

bond0     no wireless extensions.

Tüm kurulımlardan sonra masaüstüm.
6
Yazılım Yükleme ve Kaldırma / Ynt: AMPPS kaldırmak
« Son İleti Gönderen: Panta rhei Bugün, 13:11:55 »
Kod: [Seç]
/usr/localdizinine gidip dosyayı normal olarak silemiyoruz.Permission yok.

komut satırından dizine girip rm -rf yaparak silebiliyoruz

Kod: [Seç]
cd /usr/local
sudo rm -rf ampps

7
pepperflashplugin-nonfree Chrome tarayıcısının entegre pepper-flash eklentisini edinmek için kullanılıyordu, Chrome buna son verince artık kullanılamaz olmuş, depodaki adobe-flashplugin paketinin kurulması Chromium tabanlı tarayıcılar içinde yeterliymiş.

Bu sebeple aşağıdaki komutla flash ile ilgili paketleri kaldırıp,

Kod: [Seç]
sudo apt-get purge adobe-flashplugin pepperflashplugin-nonfree
aşağıdaki komutla adobe-flashplugin paketini yeniden kurmayı deneyebilirsiniz.

Kod: [Seç]
sudo apt-get install adobe-flashplugin
Eğer sorun çözülmezse, oynatılamayan bir video bağlantısı paylaşırsanız kontrol edebiliriz.
8
Aşağıdaki komutlarla kurulum dener misiniz?

Kod: [Seç]
sudo apt-get -y install linux-headers-sun7i build-essential
Kod: [Seç]
wget -c --no-check-certificate http://cdn-cw.mediatek.com/Downloads/linux/DPO_MT7601U_LinuxSTA_3.0.0.4_20130913.tar.bz2
Kod: [Seç]
tar -jxvf DPO_MT7601U_LinuxSTA_3.0.0.4_20130913.tar.bz2
Kod: [Seç]
cd DPO_MT7601U_LinuxSTA_3.0.0.4_20130913
Kod: [Seç]
make
Kod: [Seç]
make install
Kod: [Seç]
modprobe mt7601Usta
9
İlk komutun kurulumunda şöyle bir mesaj ile karşılaştım ve kurulum devam etmedi.  Ayrıca 3.14 çekirdeğini elle kurup kurmadığıma emin değilim açıkcası acemiyim birkaç birşeyler kurmaya çalıştım ama mosquitto, node red gibi şeyler.
Kod: [Seç]
sudo apt-get -y install update-usbids  linux-headers-sun7i build-essential fakeroot
Reading package lists... Done
Building dependency tree
Reading state information... Done
E: Unable to locate package update-usbids
10
Sanat ve Üretim / Ynt: Conky 18.2 Mate deki problem
« Son İleti Gönderen: ozzdemir.emre Bugün, 01:53:50 »
https://www.linuxandubuntu.com/home/what-is-conky-and-how-to-configure-conky-on-ubuntu-1604 linkdeki kuruluma göre yeniden yükleme yaptım.Bu sefer home  dizinine .conky klasörü geldi ve gerisini de managerden hallettim.Managerden penere halinde olan conkylerin içine girip own windowsu yes olarak değiştirince oldu. Teşekkürler.Konu kilitlenebilir.
Sayfa: [1] 2 3 ... 10